Time indexed situation
type: Class
subclass of: Restriction
  on property: atTime
  some values from: TemporalEntity
subclass of: Restriction
  on property: forEntity
  some values from: Thing
comment: A Situation that is explicitly indexed at some time for at least one entity.